Target
Bifunctional dihydrofolate reductase-thymidylate synthase
Ligand
BDBM134284
Substrate
Meas. Tech.
Spectrophotometric Enzyme Assay
IC50
16±n/a nM
Citation
 Anderson, ACWright, DLFrey, KMPaulsen, JLScocchera, EWViswanathan, K Heterocyclic analogs of propargyl-linked inhibitors of dihydrofolate reductase US Patent  US8853228 Publication Date 10/7/2014 
Target
Name:
Bifunctional dihydrofolate reductase-thymidylate synthase
Synonyms:
ChDHFR-TS | Dihydrofolate Reductase (DHFR)
Type:
Enzyme
Mol. Mass.:
60186.98
Organism:
Cryptosporidium hominis
Description:
ChDHFR-TS was expressed in E. coli and purified using a methotrexate agarose column.
Residue:
521
  
Inhibitor
Name:
BDBM134284
Synonyms:
US8853228, F26I
Type:
Small organic molecule
Emp. Form.:
C28H34N4O
Mol. Mass.:
442.5958
SMILES:
COc1cc(ccc1C(C)C#Cc1c(C)nc(N)nc1N)-c1c(cccc1C(C)C)C(C)C
: