Target
Bifunctional dihydrofolate reductase-thymidylate synthase
Ligand
BDBM25827
Substrate
Meas. Tech.
Spectrophotometric Enzyme Assay
IC50
30±n/a nM
Citation
 Anderson, ACWright, DLFrey, KMPaulsen, JLScocchera, EWViswanathan, K Heterocyclic analogs of propargyl-linked inhibitors of dihydrofolate reductase US Patent  US8853228 Publication Date 10/7/2014 
Target
Name:
Bifunctional dihydrofolate reductase-thymidylate synthase
Synonyms:
ChDHFR-TS | Dihydrofolate Reductase (DHFR)
Type:
Enzyme
Mol. Mass.:
60186.98
Organism:
Cryptosporidium hominis
Description:
ChDHFR-TS was expressed in E. coli and purified using a methotrexate agarose column.
Residue:
521
  
Inhibitor
Name:
BDBM25827
Synonyms:
5-[(3S)-3-(3-methoxy-5-phenylphenyl)but-1-yn-1-yl]-6-methylpyrimidine-2,4-diamine | propargyl-based inhibitor, S-10a
Type:
Small organic molecule
Emp. Form.:
C22H22N4O
Mol. Mass.:
358.4363
SMILES:
COc1cc(cc(c1)-c1ccccc1)[C@H](C)C#Cc1c(C)nc(N)nc1N
: