Target
Dihydrofolate reductase
Ligand
BDBM134286
Substrate
Meas. Tech.
Enzyme Inhibition Assay
IC50
21±n/a nM
Citation
 Anderson, ACWright, DLFrey, KMPaulsen, JLScocchera, EWViswanathan, K Heterocyclic analogs of propargyl-linked inhibitors of dihydrofolate reductase US Patent  US8853228 Publication Date 10/7/2014 
Target
Name:
Dihydrofolate reductase
Synonyms:
DYR_STAAU Dihydrofolate reductase Tetrahydrofolate dehydrogenase | folA
Type:
Enzyme
Mol. Mass.:
18249.71
Organism:
Staphylococcus aureus
Description:
Residue:
159
  
Inhibitor
Name:
BDBM134286
Synonyms:
US8853228, 149
Type:
Small organic molecule
Emp. Form.:
C21H21N5O
Mol. Mass.:
359.4243
SMILES:
CCc1nc(N)nc(N)c1C#CCc1cc(ccc1OC)-c1ccncc1
: