Target
Dihydrofolate reductase
Ligand
BDBM50329609
Substrate
Meas. Tech.
Enzyme Inhibition Assay
IC50
26±n/a nM
Citation
 Anderson, ACWright, DLFrey, KMPaulsen, JLScocchera, EWViswanathan, K Heterocyclic analogs of propargyl-linked inhibitors of dihydrofolate reductase US Patent  US8853228 Publication Date 10/7/2014 
Target
Name:
Dihydrofolate reductase
Synonyms:
Dihydrofolate reductase (DHFR)
Type:
Enzyme
Mol. Mass.:
19690.71
Organism:
Streptococcus pyogenes
Description:
J7IFZ2
Residue:
165
  
Inhibitor
Name:
BDBM50329609
Synonyms:
5-(3-(biphenyl-3-yl)prop-1-ynyl)-6-ethylpyrimidine-2,4-diamine | CHEMBL1270439
Type:
Small organic molecule
Emp. Form.:
C21H20N4
Mol. Mass.:
328.4103
SMILES:
CCc1nc(N)nc(N)c1C#CCc1cccc(c1)-c1ccccc1
: