Target
Dihydrofolate reductase
Ligand
BDBM50007817
Substrate
Meas. Tech.
Enzyme Inhibition Assay
IC50
23±n/a nM
Citation
 Anderson, ACWright, DLFrey, KMPaulsen, JLScocchera, EWViswanathan, K Heterocyclic analogs of propargyl-linked inhibitors of dihydrofolate reductase US Patent  US8853228 Publication Date 10/7/2014 
Target
Name:
Dihydrofolate reductase
Synonyms:
Dihydrofolate reductase (DHFR)
Type:
Enzyme
Mol. Mass.:
19690.71
Organism:
Streptococcus pyogenes
Description:
J7IFZ2
Residue:
165
  
Inhibitor
Name:
BDBM50007817
Synonyms:
CHEMBL3234115
Type:
Small organic molecule
Emp. Form.:
C22H22N4O
Mol. Mass.:
358.4363
SMILES:
COc1ccc(cc1C(C)C#Cc1c(C)nc(N)nc1N)-c1ccccc1
: