Target
Dihydrofolate reductase
Ligand
BDBM134285
Substrate
Meas. Tech.
Enzyme Inhibition Assay
IC50
26±n/a nM
Citation
 Anderson, ACWright, DLFrey, KMPaulsen, JLScocchera, EWViswanathan, K Heterocyclic analogs of propargyl-linked inhibitors of dihydrofolate reductase US Patent  US8853228 Publication Date 10/7/2014 
Target
Name:
Dihydrofolate reductase
Synonyms:
Dihydrofolate reductase (DHFR)
Type:
Enzyme
Mol. Mass.:
19690.71
Organism:
Streptococcus pyogenes
Description:
J7IFZ2
Residue:
165
  
Inhibitor
Name:
BDBM134285
Synonyms:
US8853228, 146
Type:
Small organic molecule
Emp. Form.:
C23H24N4O
Mol. Mass.:
372.4629
SMILES:
CCc1nc(N)nc(N)c1C#CC(C)c1cc(ccc1OC)-c1ccccc1
: