Target
Dihydrofolate reductase
Ligand
BDBM50429700
Substrate
Meas. Tech.
Enzyme Inhibition Assay
IC50
26±n/a nM
Citation
 Anderson, ACWright, DLFrey, KMPaulsen, JLScocchera, EWViswanathan, K Heterocyclic analogs of propargyl-linked inhibitors of dihydrofolate reductase US Patent  US8853228 Publication Date 10/7/2014 
Target
Name:
Dihydrofolate reductase
Synonyms:
Dihydrofolate reductase (DHFR)
Type:
Enzyme
Mol. Mass.:
19690.71
Organism:
Streptococcus pyogenes
Description:
J7IFZ2
Residue:
165
  
Inhibitor
Name:
BDBM50429700
Synonyms:
CHEMBL2335416
Type:
Small organic molecule
Emp. Form.:
C20H25N5O2
Mol. Mass.:
367.4448
SMILES:
COc1cc(cc(c1)N1CCOCC1)C(C)C#Cc1c(C)nc(N)nc1N
: