Target
Dihydrofolate reductase
Ligand
BDBM134290
Substrate
Meas. Tech.
Enzyme Inhibition Assay
IC50
23±n/a nM
Citation
 Anderson, ACWright, DLFrey, KMPaulsen, JLScocchera, EWViswanathan, K Heterocyclic analogs of propargyl-linked inhibitors of dihydrofolate reductase US Patent  US8853228 Publication Date 10/7/2014 
Target
Name:
Dihydrofolate reductase
Synonyms:
Dihydrofolate reductase (DHFR)
Type:
Enzyme
Mol. Mass.:
19690.71
Organism:
Streptococcus pyogenes
Description:
J7IFZ2
Residue:
165
  
Inhibitor
Name:
BDBM134290
Synonyms:
US8853228, 155
Type:
Small organic molecule
Emp. Form.:
C19H18N6
Mol. Mass.:
330.3864
SMILES:
CCc1nc(N)nc(N)c1C#CCc1cccc(c1)-c1cncnc1
: