Target
5-hydroxytryptamine receptor 5A
Ligand
BDBM135780
Substrate
Meas. Tech.
Binding Inhibition Assay
pH
7.5±n/a
Temperature
298.15±n/a K
Ki
1.3±n/a nM
Comments
extracted
Citation
 Kinoyama, IMiyazaki, TKoganemaru, YWashio, THamaguchi, W Nitrogenous-ring acylguanidine derivative US Patent  US8853242 Publication Date 10/7/2014 
Target
Name:
5-hydroxytryptamine receptor 5A
Synonyms:
5-HT-5 5-hydroxytryptamine receptor 5 (5-HT5) 5HT5A_HUMAN Serotonin (5-HT) receptor | Serotonin receptor 5A
Type:
Enzyme
Mol. Mass.:
40266.25
Organism:
Homo sapiens (Human)
Description:
P47898
Residue:
357
  
Inhibitor
Name:
BDBM135780
Synonyms:
US8853242, 60
Type:
Small organic molecule
Emp. Form.:
C17H11ClF2N4O
Mol. Mass.:
360.745
SMILES:
NC(N)=NC(=O)c1ccc2ncc(Cl)c(-c3ccc(F)cc3F)c2c1
: