Target
5-hydroxytryptamine receptor 5A
Ligand
BDBM135791
Substrate
Meas. Tech.
Binding Inhibition Assay
pH
7.5±n/a
Temperature
298.15±n/a K
Ki
4.7±n/a nM
Comments
extracted
Citation
 Kinoyama, IMiyazaki, TKoganemaru, YWashio, THamaguchi, W Nitrogenous-ring acylguanidine derivative US Patent  US8853242 Publication Date 10/7/2014 
Target
Name:
5-hydroxytryptamine receptor 5A
Synonyms:
5-HT-5 5-hydroxytryptamine receptor 5 (5-HT5) 5HT5A_HUMAN Serotonin (5-HT) receptor | Serotonin receptor 5A
Type:
Enzyme
Mol. Mass.:
40266.25
Organism:
Homo sapiens (Human)
Description:
P47898
Residue:
357
  
Inhibitor
Name:
BDBM135791
Synonyms:
US8853242, 164
Type:
Small organic molecule
Emp. Form.:
C16H10ClF2N5O
Mol. Mass.:
361.733
SMILES:
NC(N)=NC(=O)c1ccc2c(F)cnc(-c3c(F)cncc3Cl)c2c1
: