Target
5-hydroxytryptamine receptor 5A
Ligand
BDBM135793
Substrate
Meas. Tech.
Binding Inhibition Assay
pH
7.5±n/a
Temperature
298.15±n/a K
Ki
6.2±n/a nM
Comments
extracted
Citation
 Kinoyama, IMiyazaki, TKoganemaru, YWashio, THamaguchi, W Nitrogenous-ring acylguanidine derivative US Patent  US8853242 Publication Date 10/7/2014 
Target
Name:
5-hydroxytryptamine receptor 5A
Synonyms:
5-HT-5 5-hydroxytryptamine receptor 5 (5-HT5) 5HT5A_HUMAN Serotonin (5-HT) receptor | Serotonin receptor 5A
Type:
Enzyme
Mol. Mass.:
40266.25
Organism:
Homo sapiens (Human)
Description:
P47898
Residue:
357
  
Inhibitor
Name:
BDBM135793
Synonyms:
US8853242, 171
Type:
Small organic molecule
Emp. Form.:
C16H10ClF2N5O
Mol. Mass.:
361.733
SMILES:
[#7]\[#6](-[#7])=[#7]\[#6](=O)-c1ccc2c(F)cnc(-c3ncc(F)cc3Cl)c2c1
: