Target
5-hydroxytryptamine receptor 1A
Ligand
BDBM136318
Substrate
Meas. Tech.
Inhibition Assay
pH
7.4±n/a
Ki
0.2±n/a nM
Comments
extracted
Citation
 Andersson, JGyback, HJohansson, ALinde, CEMalmstrom, JNordvall, GWeigelt, TTerp, G 2-carboxamide-7-piperazinyl-benzofuran derivatives US Patent  US8859534 Publication Date 10/14/2014 
Target
Name:
5-hydroxytryptamine receptor 1A
Synonyms:
5-hydroxytryptamine receptor 1A (5HT1A)
Type:
Protein
Mol. Mass.:
46351.20
Organism:
Cricetulus griseus (Chinese hamster) (Cricetulus barabensis griseus)
Description:
G3I1B6
Residue:
422
  
Inhibitor
Name:
BDBM136318
Synonyms:
US8859534, 4
Type:
Small organic molecule
Emp. Form.:
C28H30N4O4S
Mol. Mass.:
518.627
SMILES:
CS(=O)(=O)c1ccc(CNC(=O)c2cc3cccc(N4CCN(CCc5ccccn5)CC4)c3o2)cc1
: