Target
Serine hydroxymethyltransferase, cytosolic
Ligand
BDBM285669
Substrate
Meas. Tech.
Inhibition of Human SHMT
pH
7.4±n/a
IC50
17.0±n/a nM
Comments
extracted
Citation
 Rabinowitz, JDKim, HDucker, GSGhergurovich, JM SHMT inhibitors US Patent  US10077273 Publication Date 9/18/2018 
Target
Name:
Serine hydroxymethyltransferase, cytosolic
Synonyms:
GLYC_HUMAN SHMT Serine methylase
Type:
PROTEIN
Mol. Mass.:
53091.10
Organism:
Homo sapiens (Human)
Description:
ChEMBL_745716
Residue:
483
  
Inhibitor
Name:
BDBM285669
Synonyms:
US10077273, Compound 74 US10934305, Compound 74
Type:
Small organic molecule
Emp. Form.:
C23H26N4O3
Mol. Mass.:
406.4775
SMILES:
CC(C)C1(c2c(C)n[nH]c2OC(N)=C1C#N)c1cc(CO)cc(c1)C#CCCCO
: