Target
Cathepsin K
Ligand
BDBM138148
Substrate
Meas. Tech.
Biological Assay
pH
3.5±n/a
Temperature
298.15±n/a K
IC50
6162±n/a nM
Comments
extracted
Citation
 Chaplin, DJGaddale Devanna, KKParker, EPinney, KGSong, JTrawick, ML Compositions and methods for inhibition of cathepsins US Patent  US8877967 Publication Date 11/4/2014 
Target
Name:
Cathepsin K
Synonyms:
CATK_HUMAN CTSO Cathepsin O Cathepsin X
Type:
Enzyme
Mol. Mass.:
36975.68
Organism:
Homo sapiens (Human)
Description:
P43235
Residue:
329
  
Inhibitor
Name:
BDBM138148
Synonyms:
US8877967, 18
Type:
Small organic molecule
Emp. Form.:
C22H19N3O3S
Mol. Mass.:
405.47
SMILES:
COc1ccc(cc1)C(=O)c1cccc(c1)C(=NNC(N)=S)c1ccc(O)cc1
: