Target
Cathepsin B
Ligand
BDBM138153
Substrate
Meas. Tech.
Biological Assay
pH
6±n/a
IC50
>10000±n/a nM
Comments
extracted
Citation
 Chaplin, DJGaddale Devanna, KKParker, EPinney, KGSong, JTrawick, ML Compositions and methods for inhibition of cathepsins US Patent  US8877967 Publication Date 11/4/2014 
Target
Name:
Cathepsin B
Synonyms:
APP secretase CATB_HUMAN CTSB Cathepsin B light chain | Cathepsin B1
Type:
Enzyme
Mol. Mass.:
37819.69
Organism:
Homo sapiens (Human)
Description:
gi_63102437
Residue:
339
  
Inhibitor
Name:
BDBM138153
Synonyms:
US8877967, 24
Type:
Small organic molecule
Emp. Form.:
C22H18Br2N6S2
Mol. Mass.:
590.357
SMILES:
NC(=S)NN=C(c1ccc(Br)cc1)c1cccc(c1)C(=NNC(N)=S)c1ccc(Br)cc1
: