Target
Poly [ADP-ribose] polymerase 1
Ligand
BDBM138348
Substrate
Meas. Tech.
Biochemical Assay
Kd
<10±n/a nM
Citation
 Papeo, GMAnatolievna Busel, AKhvat, AKrasavin, MYForte, BZuccotto, F 3-oxo-2,3-dihydro-1H-isoindole-4-carboxamides as PARP inhibitors US Patent  US8877944 Publication Date 11/4/2014 
Target
Name:
Poly [ADP-ribose] polymerase 1
Synonyms:
Adprp Adprt1 Parp1 Poly [ADP-ribose] polymerase-1
Type:
PROTEIN
Mol. Mass.:
113131.74
Organism:
Mus musculus
Description:
ChEMBL_159828
Residue:
1013
  
Inhibitor
Name:
BDBM138348
Synonyms:
US8877944, 99
Type:
Small organic molecule
Emp. Form.:
C20H24F3N3O2
Mol. Mass.:
395.4187
SMILES:
NC(=O)c1cc(F)cc2CN(C3CCN(CC3)C3CCC(F)(F)CC3)C(=O)c12
: