Target
Dipeptidyl peptidase 1
Ligand
BDBM138510
Substrate
Meas. Tech.
Inhibition Assay
pH
6±n/a
Temperature
298.15±n/a K
IC50
159.8±n/a nM
Comments
extracted
Citation
 Anderskewitz, RGrauert, MGrundl, MOost, TPautsch, APeters, S Substituted 2-aza-bicyclo[2.2.2]octane-3-carboxylic acid (benzyl-cyano-methyl)-amides inhibitors of cathepsin C US Patent  US8877775 Publication Date 11/4/2014 
Target
Name:
Dipeptidyl peptidase 1
Synonyms:
CATC_HUMAN CTSC Cathepsin J Dipeptidyl peptidase 1 (DPPI) Dipeptidyl peptidase I (DPPI)
Type:
Enzyme
Mol. Mass.:
51857.28
Organism:
Homo sapiens (Human)
Description:
P53634
Residue:
463
  
Inhibitor
Name:
BDBM138510
Synonyms:
US8877775, 21 | US9073869, 21
Type:
Small organic molecule
Emp. Form.:
C28H32N4O3
Mol. Mass.:
472.5787
SMILES:
COCCN1C(=O)Cc2ccc(cc12)-c1ccc(C[C@H](NC(=O)[C@H]2NC3CCC2CC3)C#N)cc1
: