Target
Dipeptidyl peptidase 1
Ligand
BDBM138513
Substrate
Meas. Tech.
Inhibition Assay
pH
6±n/a
Temperature
298.15±n/a K
IC50
248.5±n/a nM
Comments
extracted
Citation
 Anderskewitz, RGrauert, MGrundl, MOost, TPautsch, APeters, S Substituted 2-aza-bicyclo[2.2.2]octane-3-carboxylic acid (benzyl-cyano-methyl)-amides inhibitors of cathepsin C US Patent  US8877775 Publication Date 11/4/2014 
Target
Name:
Dipeptidyl peptidase 1
Synonyms:
CATC_HUMAN CTSC Cathepsin J Dipeptidyl peptidase 1 (DPPI) Dipeptidyl peptidase I (DPPI)
Type:
Enzyme
Mol. Mass.:
51857.28
Organism:
Homo sapiens (Human)
Description:
P53634
Residue:
463
  
Inhibitor
Name:
BDBM138513
Synonyms:
US8877775, 24 | US9073869, 24
Type:
Small organic molecule
Emp. Form.:
C23H23N5O
Mol. Mass.:
385.4616
SMILES:
O=C(N[C@@H](Cc1ccc(cc1)-c1ccnc(c1)C#N)C#N)[C@H]1NC2CCC1CC2
: