Target
Dipeptidyl peptidase 1
Ligand
BDBM138514
Substrate
Meas. Tech.
Inhibition Assay
pH
6±n/a
Temperature
298.15±n/a K
IC50
98±n/a nM
Comments
extracted
Citation
 Anderskewitz, RGrauert, MGrundl, MOost, TPautsch, APeters, S Substituted 2-aza-bicyclo[2.2.2]octane-3-carboxylic acid (benzyl-cyano-methyl)-amides inhibitors of cathepsin C US Patent  US8877775 Publication Date 11/4/2014 
Target
Name:
Dipeptidyl peptidase 1
Synonyms:
CATC_HUMAN CTSC Cathepsin J Dipeptidyl peptidase 1 (DPPI) Dipeptidyl peptidase I (DPPI)
Type:
Enzyme
Mol. Mass.:
51857.28
Organism:
Homo sapiens (Human)
Description:
P53634
Residue:
463
  
Inhibitor
Name:
BDBM138514
Synonyms:
US8877775, 25 | US9073869, 25
Type:
Small organic molecule
Emp. Form.:
C26H29FN4O
Mol. Mass.:
432.5331
SMILES:
CN1Cc2ccc(cc2C1)-c1ccc(C[C@H](NC(=O)[C@H]2NC3CCC2CC3)C#N)c(F)c1
: