Target
Cathepsin K
Ligand
BDBM138493
Substrate
Meas. Tech.
Inhibition Assay
pH
3.5±n/a
Temperature
298.15±n/a K
IC50
4200±n/a nM
Comments
extracted
Citation
 Anderskewitz, RGrauert, MGrundl, MOost, TPautsch, APeters, S Substituted 2-aza-bicyclo[2.2.2]octane-3-carboxylic acid (benzyl-cyano-methyl)-amides inhibitors of cathepsin C US Patent  US8877775 Publication Date 11/4/2014 
Target
Name:
Cathepsin K
Synonyms:
CATK_HUMAN CTSO Cathepsin O Cathepsin X
Type:
Enzyme
Mol. Mass.:
36975.68
Organism:
Homo sapiens (Human)
Description:
P43235
Residue:
329
  
Inhibitor
Name:
BDBM138493
Synonyms:
US8877775, 2 | US9073869, 2
Type:
Small organic molecule
Emp. Form.:
C25H26N4O2
Mol. Mass.:
414.4995
SMILES:
O=C(N[C@@H](Cc1ccc(cc1)-c1ccc2CC(=O)Nc2c1)C#N)[C@H]1NC2CCC1CC2
: