Target
Cathepsin K
Ligand
BDBM138494
Substrate
Meas. Tech.
Inhibition Assay
pH
3.5±n/a
Temperature
298.15±n/a K
IC50
6300±n/a nM
Comments
extracted
Citation
 Anderskewitz, RGrauert, MGrundl, MOost, TPautsch, APeters, S Substituted 2-aza-bicyclo[2.2.2]octane-3-carboxylic acid (benzyl-cyano-methyl)-amides inhibitors of cathepsin C US Patent  US8877775 Publication Date 11/4/2014 
Target
Name:
Cathepsin K
Synonyms:
CATK_HUMAN CTSO Cathepsin O Cathepsin X
Type:
Enzyme
Mol. Mass.:
36975.68
Organism:
Homo sapiens (Human)
Description:
P43235
Residue:
329
  
Inhibitor
Name:
BDBM138494
Synonyms:
US8877775, 4 | US9073869, 4
Type:
Small organic molecule
Emp. Form.:
C26H28N4O2
Mol. Mass.:
428.5261
SMILES:
CN1C(=O)Cc2ccc(cc12)-c1ccc(C[C@H](NC(=O)[C@H]2N[C@H]3CC[C@@H]2CC3)C#N)cc1
: