Target
Histone deacetylase 1
Ligand
BDBM139338
Substrate
Meas. Tech.
Enzyme Assay
pH
7.4±n/a
Temperature
298.15±n/a K
IC50
5±n/a nM
Comments
extracted
Citation
 van Duzer, JHMazitschek, RDing, YYu, NCao, YLiu, Y Pyrimidine hydroxy amide compounds as protein deacetylase inhibitors and methods of use thereof US Patent  US8614223 Publication Date 12/24/2013 
Target
Name:
Histone deacetylase 1
Synonyms:
Cereblon/Histone deacetylase 1 HDAC1 Histone deacetylase 1 (HDAC1) RPD3L1
Type:
Enzyme
Mol. Mass.:
55090.27
Organism:
Homo sapiens (Human)
Description:
Q13547
Residue:
482
  
Inhibitor
Name:
BDBM139338
Synonyms:
US8614223, 124
Type:
Small organic molecule
Emp. Form.:
C14H12F2N4O2
Mol. Mass.:
306.2675
SMILES:
ONC(=O)c1cnc(NC2(CC2)c2c(F)cccc2F)nc1
: