Target
Tyrosine-protein kinase JAK3
Ligand
BDBM43858
Substrate
Meas. Tech.
High ATP Caliper Endpoint Assay
pH
7.5±n/a
Temperature
298.15±n/a K
IC50
1.4±n/a nM
Comments
extracted
Citation
 Coe, JWDehnhardt, CMJones, PKorturn, SWSabnis, YAWakenhut, FMWhitlock, GA Indazoles US Patent  US8895544 Publication Date 11/25/2014 
Target
Name:
Tyrosine-protein kinase JAK3
Synonyms:
JAK-3 JAK3_HUMAN Janus kinase 3 (JAK3) L-JAK | Leukocyte janus kinase
Type:
Protein
Mol. Mass.:
125111.08
Organism:
Homo sapiens (Human)
Description:
P52333
Residue:
1124
  
Inhibitor
Name:
BDBM43858
Synonyms:
US8895544, 25
Type:
Emp. Form.:
C32H26FN7O
Mol. Mass.:
543.5935
SMILES:
CCc1cc(O)c(F)cc1-c1ccc2c(n[nH]c2c1)-c1nc2cc(Cc3ccc(nc3)N3CC=CC=C3)cnc2[nH]1
: