Target
Tyrosine-protein kinase JAK1
Ligand
BDBM139708
Substrate
Meas. Tech.
High ATP Caliper Endpoint Assay
pH
7.5±n/a
Temperature
298.15±n/a K
IC50
5.9±n/a nM
Comments
extracted
Citation
 Coe, JWDehnhardt, CMJones, PKorturn, SWSabnis, YAWakenhut, FMWhitlock, GA Indazoles US Patent  US8895544 Publication Date 11/25/2014 
Target
Name:
Tyrosine-protein kinase JAK1
Synonyms:
JAK-1 JAK1A JAK1_HUMAN Janus kinase 1 (JAK1) | Janus kinase 1 JAK1
Type:
Protein
Mol. Mass.:
133293.73
Organism:
Homo sapiens (Human)
Description:
P23458
Residue:
1154
  
Inhibitor
Name:
BDBM139708
Synonyms:
US8895544, 21
Type:
Small organic molecule
Emp. Form.:
C28H24FN7O
Mol. Mass.:
493.5349
SMILES:
CCc1cc(O)c(F)cc1-c1ccc2c(n[nH]c2c1)-c1nc2CN(Cc3ccnc(c3)C#N)CCc2[nH]1
: