Target
Tyrosine-protein kinase JAK1
Ligand
BDBM139709
Substrate
Meas. Tech.
High ATP Caliper Endpoint Assay
pH
7.5±n/a
Temperature
298.15±n/a K
IC50
3±n/a nM
Comments
extracted
Citation
 Coe, JWDehnhardt, CMJones, PKorturn, SWSabnis, YAWakenhut, FMWhitlock, GA Indazoles US Patent  US8895544 Publication Date 11/25/2014 
Target
Name:
Tyrosine-protein kinase JAK1
Synonyms:
JAK-1 JAK1A JAK1_HUMAN Janus kinase 1 (JAK1) | Janus kinase 1 JAK1
Type:
Protein
Mol. Mass.:
133293.73
Organism:
Homo sapiens (Human)
Description:
P23458
Residue:
1154
  
Inhibitor
Name:
BDBM139709
Synonyms:
US8895544, 22
Type:
Small organic molecule
Emp. Form.:
C29H28FN5O2
Mol. Mass.:
497.5633
SMILES:
CCc1cc(O)c(F)cc1-c1ccc2c(n[nH]c2c1)-c1nc2CN(Cc3cccc(OC)c3)CCc2[nH]1
: