Target
Tyrosine-protein kinase JAK1
Ligand
BDBM139713
Substrate
Meas. Tech.
High ATP Caliper Endpoint Assay
pH
7.5±n/a
Temperature
298.15±n/a K
IC50
7.7±n/a nM
Comments
extracted
Citation
 Coe, JWDehnhardt, CMJones, PKorturn, SWSabnis, YAWakenhut, FMWhitlock, GA Indazoles US Patent  US8895544 Publication Date 11/25/2014 
Target
Name:
Tyrosine-protein kinase JAK1
Synonyms:
JAK-1 JAK1A JAK1_HUMAN Janus kinase 1 (JAK1) | Janus kinase 1 JAK1
Type:
Protein
Mol. Mass.:
133293.73
Organism:
Homo sapiens (Human)
Description:
P23458
Residue:
1154
  
Inhibitor
Name:
BDBM139713
Synonyms:
US8895544, 30
Type:
Small organic molecule
Emp. Form.:
C28H20F5N5O2
Mol. Mass.:
553.4827
SMILES:
Oc1cc(CC(F)(F)F)c(cc1F)-c1ccc2c(n[nH]c2c1)-c1nc2CN(CCc2[nH]1)C(=O)c1ccc(F)cc1
: