Target
3-phosphoinositide-dependent protein kinase 1
Ligand
BDBM139835
Substrate
Meas. Tech.
Kinase Assay
pH
7.5±n/a
IC50
5±n/a nM
Comments
extracted
Citation
 McConnell, DEngelhardt, HKofink, C 1H-imidazo[4,5-c]quinolines US Patent  US8895581 Publication Date 11/25/2014 
Target
Name:
3-phosphoinositide-dependent protein kinase 1
Synonyms:
3-Phosphoinositide-Dependent Protein Kinase 1 (PDK1) 3-phosphoinositide-dependent protein kinase 1 3-phosphoinositide-dependent protein kinase 1 (PDK-1) Isoform 2 of 3-phosphoinositide-dependent protein kinase 1 PDPK1 Phosphoinositide-dependent protein kinase 1 (PDK1) hPDK1
Type:
Enzyme
Mol. Mass.:
63157.65
Organism:
Homo sapiens (Human)
Description:
O15530
Residue:
556
  
Inhibitor
Name:
BDBM139835
Synonyms:
US8895581, III-21
Type:
Small organic molecule
Emp. Form.:
C32H30F2N6O3
Mol. Mass.:
584.6158
SMILES:
Cc1nc2cnc3ccc(cc3c2n1C1CCOCC1)C#CCNC(=O)c1c(C)n(C)n(Cc2ccc(F)c(F)c2)c1=O
: