Target
3-phosphoinositide-dependent protein kinase 1
Ligand
BDBM139848
Substrate
Meas. Tech.
Kinase Assay
pH
7.5±n/a
IC50
8±n/a nM
Comments
extracted
Citation
 McConnell, DEngelhardt, HKofink, C 1H-imidazo[4,5-c]quinolines US Patent  US8895581 Publication Date 11/25/2014 
Target
Name:
3-phosphoinositide-dependent protein kinase 1
Synonyms:
3-Phosphoinositide-Dependent Protein Kinase 1 (PDK1) 3-phosphoinositide-dependent protein kinase 1 3-phosphoinositide-dependent protein kinase 1 (PDK-1) Isoform 2 of 3-phosphoinositide-dependent protein kinase 1 PDPK1 Phosphoinositide-dependent protein kinase 1 (PDK1) hPDK1
Type:
Enzyme
Mol. Mass.:
63157.65
Organism:
Homo sapiens (Human)
Description:
O15530
Residue:
556
  
Inhibitor
Name:
BDBM139848
Synonyms:
US8895581, III-34
Type:
Small organic molecule
Emp. Form.:
C27H20F2N6O2
Mol. Mass.:
498.4835
SMILES:
Cc1nc2cnc3ccc(cc3c2n1C)C#CCNC(=O)c1cncn(Cc2ccc(F)c(F)c2)c1=O
: