Target
3-phosphoinositide-dependent protein kinase 1
Ligand
BDBM139850
Substrate
Meas. Tech.
Kinase Assay
pH
7.5±n/a
IC50
5±n/a nM
Comments
extracted
Citation
 McConnell, DEngelhardt, HKofink, C 1H-imidazo[4,5-c]quinolines US Patent  US8895581 Publication Date 11/25/2014 
Target
Name:
3-phosphoinositide-dependent protein kinase 1
Synonyms:
3-Phosphoinositide-Dependent Protein Kinase 1 (PDK1) 3-phosphoinositide-dependent protein kinase 1 3-phosphoinositide-dependent protein kinase 1 (PDK-1) Isoform 2 of 3-phosphoinositide-dependent protein kinase 1 PDPK1 Phosphoinositide-dependent protein kinase 1 (PDK1) hPDK1
Type:
Enzyme
Mol. Mass.:
63157.65
Organism:
Homo sapiens (Human)
Description:
O15530
Residue:
556
  
Inhibitor
Name:
BDBM139850
Synonyms:
US8895581, 316 | US8895581, IV-1
Type:
Small organic molecule
Emp. Form.:
C30H26F2N6O3
Mol. Mass.:
556.5626
SMILES:
CCOc1cc(C(=O)NCC#Cc2ccc3ncc4ncn(C(C)C)c4c3c2)c(=O)n(Cc2ccc(F)c(F)c2)n1
: