Target
Fibroblast growth factor receptor 3
Ligand
BDBM139908
Substrate
Meas. Tech.
In Vitro Kinase Inhibitory Activity Assay
pH
7.5±n/a
IC50
3.3±n/a nM
Citation
 Berdini, VBesong, GECallaghan, OCarr, MGCongreve, MSGill, ALGriffiths-Jones, CMMadin, AMurray, CWNijjar, RKO'Brien, MAPike, ASaxty, GTaylor, RDVickerstaffe, E Bicyclic heterocyclic compounds as FGFR inhibitors US Patent  US8895745 Publication Date 11/25/2014 
Target
Name:
Fibroblast growth factor receptor 3
Synonyms:
CD_antigen: CD333 FGFR3 Fibroblast growth factor receptor JTK4
Type:
Protein
Mol. Mass.:
87699.57
Organism:
Homo sapiens (Human)
Description:
P22607
Residue:
806
  
Inhibitor
Name:
BDBM139908
Synonyms:
US8895745, 59
Type:
Small organic molecule
Emp. Form.:
C22H16F4N4O
Mol. Mass.:
428.3823
SMILES:
Fc1ccc(cc1)-c1ccn2c(cnc2c1)-c1cccc(NC(=O)NCC(F)(F)F)c1
: