Target
Fibroblast growth factor receptor 3
Ligand
BDBM139923
Substrate
Meas. Tech.
In Vitro Kinase Inhibitory Activity Assay
pH
7.5±n/a
IC50
3.3±n/a nM
Citation
 Berdini, VBesong, GECallaghan, OCarr, MGCongreve, MSGill, ALGriffiths-Jones, CMMadin, AMurray, CWNijjar, RKO'Brien, MAPike, ASaxty, GTaylor, RDVickerstaffe, E Bicyclic heterocyclic compounds as FGFR inhibitors US Patent  US8895745 Publication Date 11/25/2014 
Target
Name:
Fibroblast growth factor receptor 3
Synonyms:
CD_antigen: CD333 FGFR3 Fibroblast growth factor receptor JTK4
Type:
Protein
Mol. Mass.:
87699.57
Organism:
Homo sapiens (Human)
Description:
P22607
Residue:
806
  
Inhibitor
Name:
BDBM139923
Synonyms:
US8895745, 422
Type:
Small organic molecule
Emp. Form.:
C18H13F3N6OS
Mol. Mass.:
418.396
SMILES:
FC(F)(F)CNC(=O)Nc1cccc(c1)-c1cnc2cc(ccn12)-c1ncns1
: