Target
Serine/threonine-protein kinase pim-1
Ligand
BDBM141326
Substrate
Meas. Tech.
Kinase Assay
pH
3±n/a
IC50
2454±n/a nM
Comments
extracted
Citation
 Caldarelli, MCasuscelli, FDonati, DMirizzi, DQuartieri, FSilvagni, M Tricyclic derivatives, process for their preparation and their use as kinase inhibitors US Patent  US8916577 Publication Date 12/23/2014 
Target
Name:
Serine/threonine-protein kinase pim-1
Synonyms:
PIM-1 Kinase PIM1_HUMAN Serine/threonine-protein kinase (PIM1) Serine/threonine-protein kinase PIM1 | Serine/threonine-protein kinase pim-1 (PIM1)
Type:
Protein
Mol. Mass.:
35681.82
Organism:
Homo sapiens (Human)
Description:
P11309
Residue:
313
  
Inhibitor
Name:
BDBM141326
Synonyms:
US8916577, 67
Type:
Small organic molecule
Emp. Form.:
C23H28N8O
Mol. Mass.:
432.5214
SMILES:
CN1CCN(CC1)c1ccc(Nc2ncc3CCCc4c(nn(C)c4-c3n2)C(N)=O)cc1
: