Target
Epidermal growth factor receptor [T790M,L858R]
Ligand
BDBM202370
Substrate
Meas. Tech.
Omnia Assay Protocol for Potency Assessment Against EGFR (WT) and EGFR (T790M/L858R) Active Enzymes
pH
7.5±n/a
IC50
5.50±n/a nM
Comments
extracted
Citation
 Lee, KNiu, DPetter, RCSingh, J Heteroaryl compounds and uses thereof US Patent  US10081606 Publication Date 9/25/2018 
Target
Name:
Epidermal growth factor receptor [T790M,L858R]
Synonyms:
EGFR EGFR_HUMAN ERBB1 Epidermal growth factor receptor (EGFR)(T790M/L858R) Epidermal growth factor receptor (T790M, L858R) Epidermal growth factor receptor(L858R, T790M) | HER1
Type:
Mol. Mass.:
134353.72
Organism:
Homo sapiens (Human)
Description:
P00533[T790M,L858R]
Residue:
1210
  
Inhibitor
Name:
BDBM202370
Synonyms:
US10081606, Compound I-2 US9765038, Compound I-2
Type:
Small organic molecule
Emp. Form.:
C21H17F3N4O3
Mol. Mass.:
430.3799
SMILES:
COc1ccccc1Nc1ncc(c(Oc2cccc(NC(=O)C=C)c2)n1)C(F)(F)F
: