Target
Integrin alpha-5
Ligand
BDBM141981
Substrate
Meas. Tech.
Binding Assay
pH
9.6±n/a
Temperature
277.15±n/a K
IC50
<100±n/a nM
Comments
extracted
Citation
 Zischinsky, GStragies, ROsterkamp, FScharn, DHummel, GKalkhof, HZahn, GVossmeyer, DChristner-Albrecht, CReineke, U Compounds for the inhibition of integrins and use thereof US Patent  US8927534 Publication Date 1/6/2015 
Target
Name:
Integrin alpha-5
Synonyms:
CD49 antigen-like family member E FNRA Fibronectin receptor subunit alpha ITGA5 Integrin alpha-F | VLA-5
Type:
Single-pass type I membrane protein
Mol. Mass.:
114523.00
Organism:
Homo sapiens (Human)
Description:
Residue:
1049
  
Inhibitor
Name:
BDBM141981
Synonyms:
US8927534, 120
Type:
Small organic molecule
Emp. Form.:
C30H35FN4O3
Mol. Mass.:
518.6223
SMILES:
CCc1cc(F)cc(C)c1C(=O)NC(Cc1ccc(cc1)N1CCC(CNc2ccccn2)CC1)C(O)=O
: