Target
Integrin alpha-5
Ligand
BDBM50423736
Substrate
Meas. Tech.
Binding Assay
pH
9.6±n/a
Temperature
277.15±n/a K
IC50
<100±n/a nM
Comments
extracted
Citation
 Zischinsky, GStragies, ROsterkamp, FScharn, DHummel, GKalkhof, HZahn, GVossmeyer, DChristner-Albrecht, CReineke, U Compounds for the inhibition of integrins and use thereof US Patent  US8927534 Publication Date 1/6/2015 
Target
Name:
Integrin alpha-5
Synonyms:
CD49 antigen-like family member E FNRA Fibronectin receptor subunit alpha ITGA5 Integrin alpha-F | VLA-5
Type:
Single-pass type I membrane protein
Mol. Mass.:
114523.00
Organism:
Homo sapiens (Human)
Description:
Residue:
1049
  
Inhibitor
Name:
BDBM50423736
Synonyms:
CHEMBL591543
Type:
Small organic molecule
Emp. Form.:
C31H38N4O4
Mol. Mass.:
530.6578
SMILES:
COc1ccnc(NCC2CCN(CC2)c2ccc(CC(NC(=O)c3c(C)cc(C)cc3C)C(O)=O)cc2)c1
: