Target
Integrin alpha-5
Ligand
BDBM141994
Substrate
Meas. Tech.
Binding Assay
pH
9.6±n/a
Temperature
277.15±n/a K
IC50
<100±n/a nM
Comments
extracted
Citation
 Zischinsky, GStragies, ROsterkamp, FScharn, DHummel, GKalkhof, HZahn, GVossmeyer, DChristner-Albrecht, CReineke, U Compounds for the inhibition of integrins and use thereof US Patent  US8927534 Publication Date 1/6/2015 
Target
Name:
Integrin alpha-5
Synonyms:
CD49 antigen-like family member E FNRA Fibronectin receptor subunit alpha ITGA5 Integrin alpha-F | VLA-5
Type:
Single-pass type I membrane protein
Mol. Mass.:
114523.00
Organism:
Homo sapiens (Human)
Description:
Residue:
1049
  
Inhibitor
Name:
BDBM141994
Synonyms:
US8927534, 269
Type:
Small organic molecule
Emp. Form.:
C29H40N4O4
Mol. Mass.:
508.6523
SMILES:
CCCNC(=O)NCC1CCN(CC1)c1ccc(CC(NC(=O)c2c(C)cc(C)cc2C)C(O)=O)cc1
: