Target
Bcl-2-related protein A1
Ligand
BDBM142749
Substrate
Meas. Tech.
Fluorescence Polarization Assay
Temperature
298.15±n/a K
IC50
690±n/a nM
Comments
extracted
Citation
 Pellecchia, MWei, J Apogossypolone derivatives as anticancer agents US Patent  US8937193 Publication Date 1/20/2015 
Target
Name:
Bcl-2-related protein A1
Synonyms:
B2LA1_HUMAN BCL2L5 Bcl-2-like protein 5 HBPA1 Protein BFL-1 | Protein GRS
Type:
Apoptosis regulator protein
Mol. Mass.:
20130.01
Organism:
Homo sapiens (Human)
Description:
Residue:
175
  
Inhibitor
Name:
BDBM142749
Synonyms:
US8937193, 7
Type:
Small organic molecule
Emp. Form.:
C38H26O10
Mol. Mass.:
642.607
SMILES:
Cc1c(-c2c(C)c(=O)c3c(C(=O)Cc4ccccc4)c(O)c(O)cc3c2=O)c(=O)c2cc(O)c(O)c(C(=O)Cc3ccccc3)c2c1=O
: