Target
Bcl-2-related protein A1
Ligand
BDBM142746
Substrate
Meas. Tech.
Fluorescence Polarization Assay
Temperature
298.15±n/a K
IC50
710±n/a nM
Comments
extracted
Citation
 Pellecchia, MWei, J Apogossypolone derivatives as anticancer agents US Patent  US8937193 Publication Date 1/20/2015 
Target
Name:
Bcl-2-related protein A1
Synonyms:
B2LA1_HUMAN BCL2L5 Bcl-2-like protein 5 HBPA1 Protein BFL-1 | Protein GRS
Type:
Apoptosis regulator protein
Mol. Mass.:
20130.01
Organism:
Homo sapiens (Human)
Description:
Residue:
175
  
Inhibitor
Name:
BDBM142746
Synonyms:
US8937193, 8a
Type:
Small organic molecule
Emp. Form.:
C42H36N2O10
Mol. Mass.:
728.7426
SMILES:
CC(CNC(=O)c1c(O)c(O)cc2c1c(=O)c(C)c(-c1c(C)c(=O)c3c(C(=O)NCC(C)c4ccccc4)c(O)c(O)cc3c1=O)c2=O)c1ccccc1
: