Target
Casein kinase II subunit alpha'
Ligand
BDBM142814
Substrate
Meas. Tech.
Kinase Assay
pH
7.4±n/a
Temperature
303.15±n/a K
IC50
0.75±n/a nM
Comments
extracted
Citation
 Purandare, AVFink, BEGavai, AVJohnson, WLHart, ACHe, LHuynh, TNInghrim, JMastalerz, HSang, XTarby, CMWan, HVaccaro, WZhang, GZhao, YZimmermann, K Imidazotriazinecarbonitriles useful as kinase inhibitors US Patent  US8940736 Publication Date 1/27/2015 
Target
Name:
Casein kinase II subunit alpha'
Synonyms:
CK2A2 CSNK2A2 Casein kinase II alpha' Casein kinase II subunit alpha (CSNK2A2)
Type:
Protein
Mol. Mass.:
41223.82
Organism:
Homo sapiens (Human)
Description:
Residue:
350
  
Inhibitor
Name:
BDBM142814
Synonyms:
US8940736, 274
Type:
Small organic molecule
Emp. Form.:
C24H26ClF2N9O
Mol. Mass.:
529.973
SMILES:
CC1(COC1)N1CCN(CC1)c1cc(cc(Nc2nc(NC3CC3)c3ncc(C#N)n3n2)c1Cl)C(F)F
: