Target
Casein kinase II subunit alpha'
Ligand
BDBM142824
Substrate
Meas. Tech.
Kinase Assay
pH
7.4±n/a
Temperature
303.15±n/a K
IC50
0.76±n/a nM
Comments
extracted
Citation
 Purandare, AVFink, BEGavai, AVJohnson, WLHart, ACHe, LHuynh, TNInghrim, JMastalerz, HSang, XTarby, CMWan, HVaccaro, WZhang, GZhao, YZimmermann, K Imidazotriazinecarbonitriles useful as kinase inhibitors US Patent  US8940736 Publication Date 1/27/2015 
Target
Name:
Casein kinase II subunit alpha'
Synonyms:
CK2A2 CSNK2A2 Casein kinase II alpha' Casein kinase II subunit alpha (CSNK2A2)
Type:
Protein
Mol. Mass.:
41223.82
Organism:
Homo sapiens (Human)
Description:
Residue:
350
  
Inhibitor
Name:
BDBM142824
Synonyms:
US8940736, 348
Type:
Small organic molecule
Emp. Form.:
C20H20ClN9
Mol. Mass.:
421.886
SMILES:
CCNc1nc(Nc2cc(cc(C3CCNCC3)c2Cl)C#N)nn2c(cnc12)[N+]#[C-]
: