Target
Microtubule-associated protein tau
Ligand
BDBM142845
Substrate
Meas. Tech.
Inhibition Assay
pH
6.5±n/a
Temperature
298.15±n/a K
IC50
15.5±n/a nM
Comments
extracted
Citation
 Sakai, DNakayama, KWatanabe, K Pyrimidone compounds US Patent  US8940738 Publication Date 1/27/2015 
Target
Name:
Microtubule-associated protein tau
Synonyms:
MAPT TAU_BOVIN | Tau Protein Kinase 1 (TPK1)
Type:
Protein
Mol. Mass.:
46340.02
Organism:
Bos taurus (Bovine)
Description:
P29172
Residue:
448
  
Inhibitor
Name:
BDBM142845
Synonyms:
US8940738, 1
Type:
Small organic molecule
Emp. Form.:
C19H19F2N5O2
Mol. Mass.:
387.3833
SMILES:
CN1C(=O)CC(N=C1N1CCO[C@H](C1)c1ccc(F)cc1)c1ncncc1F
: