Target
Microtubule-associated protein tau
Ligand
BDBM142849
Substrate
Meas. Tech.
Inhibition Assay
pH
6.5±n/a
Temperature
298.15±n/a K
IC50
33.1±n/a nM
Comments
extracted
Citation
 Sakai, DNakayama, KWatanabe, K Pyrimidone compounds US Patent  US8940738 Publication Date 1/27/2015 
Target
Name:
Microtubule-associated protein tau
Synonyms:
MAPT TAU_BOVIN | Tau Protein Kinase 1 (TPK1)
Type:
Protein
Mol. Mass.:
46340.02
Organism:
Bos taurus (Bovine)
Description:
P29172
Residue:
448
  
Inhibitor
Name:
BDBM142849
Synonyms:
US8940738, 5
Type:
Small organic molecule
Emp. Form.:
C24H27FN6O
Mol. Mass.:
434.5092
SMILES:
Cn1c(nc(cc1=O)-c1ncncc1F)N1CCCC(C1)c1ccc(cc1)N1CCCC1
: