Target
Microtubule-associated protein tau
Ligand
BDBM142852
Substrate
Meas. Tech.
Inhibition Assay
pH
6.5±n/a
Temperature
298.15±n/a K
IC50
75.3±n/a nM
Comments
extracted
Citation
 Sakai, DNakayama, KWatanabe, K Pyrimidone compounds US Patent  US8940738 Publication Date 1/27/2015 
Target
Name:
Microtubule-associated protein tau
Synonyms:
MAPT TAU_BOVIN | Tau Protein Kinase 1 (TPK1)
Type:
Protein
Mol. Mass.:
46340.02
Organism:
Bos taurus (Bovine)
Description:
P29172
Residue:
448
  
Inhibitor
Name:
BDBM142852
Synonyms:
US8940738, 8
Type:
Small organic molecule
Emp. Form.:
C19H20FN5O3
Mol. Mass.:
385.3922
SMILES:
COc1ccc(CCNc2nc(cc(=O)n2C)-c2ncncc2F)cc1OC
: