Target
Microtubule-associated protein tau
Ligand
BDBM142854
Substrate
Meas. Tech.
Inhibition Assay
pH
6.5±n/a
Temperature
298.15±n/a K
IC50
164.8±n/a nM
Comments
extracted
Citation
 Sakai, DNakayama, KWatanabe, K Pyrimidone compounds US Patent  US8940738 Publication Date 1/27/2015 
Target
Name:
Microtubule-associated protein tau
Synonyms:
MAPT TAU_BOVIN | Tau Protein Kinase 1 (TPK1)
Type:
Protein
Mol. Mass.:
46340.02
Organism:
Bos taurus (Bovine)
Description:
P29172
Residue:
448
  
Inhibitor
Name:
BDBM142854
Synonyms:
US8940738, 10
Type:
Small organic molecule
Emp. Form.:
C18H17FN6O3
Mol. Mass.:
384.3644
SMILES:
CN(CCc1ccc(cc1)[N+]([O-])=O)c1nc(cc(=O)n1C)-c1ncncc1F
: