Target
Kappa-type opioid receptor
Ligand
BDBM144351
Substrate
Meas. Tech.
Binding Assay
pH
7.4±n/a
Temperature
277.15±n/a K
Ki
0.09±n/a nM
Comments
extracted
Citation
 Goehring, RTafesse, LYao, J Buprenorphine analogs US Patent  US8969358 Publication Date 3/3/2015 
Target
Name:
Kappa-type opioid receptor
Synonyms:
K-OR-1 Kappa-opioid receptor (KOR) Kappa-type opioid receptor (KOR) OPIATE Kappa OPRK1 kappa opioid receptor (KOR)
Type:
G Protein-Coupled Receptor (GPCR)
Mol. Mass.:
42648.76
Organism:
Homo sapiens (Human)
Description:
P41145
Residue:
380
  
Inhibitor
Name:
BDBM144351
Synonyms:
US8969358, 102
Type:
Small organic molecule
Emp. Form.:
C30H43N3O4
Mol. Mass.:
509.6801
SMILES:
CC[C@H](C)[C@H](N)C(=O)NC[C@H]1C[C@]23CC[C@]1(OC)[C@@H]1Oc4c5c(C[C@H]2N(CC2CC2)CC[C@@]315)ccc4O
: