Target
cAMP and cAMP-inhibited cGMP 3',5'-cyclic phosphodiesterase 10A
Ligand
BDBM146704
Substrate
Meas. Tech.
IMAP TR-FRET assay
Temperature
298.15±n/a K
IC50
0.0064±n/a nM
Comments
extracted
Citation
 Allen, JRChen, JJFrohn, MJHu, ELiu, QPickrell, AJRumfelt, SRzasa, RMZhong, W Unsaturated nitrogen heterocyclic compounds useful as PDE10 inhibitors US Patent  US8957073 Publication Date 2/17/2015 
Target
Name:
cAMP and cAMP-inhibited cGMP 3',5'-cyclic phosphodiesterase 10A
Synonyms:
3',5'-cyclic phosphodiesterase PDE10A Phosphodiesterase 10 (PDE10) | Phosphodiesterase 10A
Type:
Protein
Mol. Mass.:
88412.52
Organism:
Homo sapiens (Human)
Description:
Q9Y233
Residue:
1055
  
Inhibitor
Name:
BDBM146704
Synonyms:
US8957073, 4.38 | US9718803, 4.38
Type:
Small organic molecule
Emp. Form.:
C23H19FN4
Mol. Mass.:
370.4222
SMILES:
Cc1cc(ccc1F)-c1nccnc1C1CN(C1)c1ccc2ccccc2n1
: