Target
5-hydroxytryptamine receptor 5A
Ligand
BDBM148154
Substrate
Meas. Tech.
Binding Assay
pH
7.4±n/a
Temperature
310.15±n/a K
Ki
1.1±n/a nM
Comments
extracted
Citation
 Hamaguchi, WKinoyama, IKoganemaru, YMiyazaki, TKaneko, OSekioka, RWashio, T Tetrahydroisoquinoline derivative US Patent  US8962612 Publication Date 2/24/2015 
Target
Name:
5-hydroxytryptamine receptor 5A
Synonyms:
5-HT-5 5-hydroxytryptamine receptor 5 (5-HT5) 5HT5A_HUMAN Serotonin (5-HT) receptor | Serotonin receptor 5A
Type:
Enzyme
Mol. Mass.:
40266.25
Organism:
Homo sapiens (Human)
Description:
P47898
Residue:
357
  
Inhibitor
Name:
BDBM148154
Synonyms:
US8962612, 23
Type:
Small organic molecule
Emp. Form.:
C17H14ClF3N4O
Mol. Mass.:
382.767
SMILES:
NC(N)=NC(=O)N1CCc2c(Cl)ccc(c2C1)-c1c(F)cc(F)cc1F
: