Target
Delta-type opioid receptor
Ligand
BDBM148986
Substrate
Meas. Tech.
Competitive Displacement Assay
pH
7.5±n/a
Temperature
298.15±n/a K
Ki
2.1±n/a nM
Comments
extracted
Citation
 Blumberg, LCArnelle, D Peripherally acting opioid compounds US Patent  US8962646 Publication Date 2/24/2015 
Target
Name:
Delta-type opioid receptor
Synonyms:
D-OR-1 Delta opioid receptor OPIATE Delta OPRD1 OPRK1 | opioid receptor, delta 1
Type:
G Protein-Coupled Receptor (GPCR)
Mol. Mass.:
40382.98
Organism:
Homo sapiens (Human)
Description:
Competition binding assays were carried out using membrane preparations from transfected HN9.10 cells that constitutively expressed the delta opioid receptor.
Residue:
372
  
Inhibitor
Name:
BDBM148986
Synonyms:
US8962646, 8
Type:
Small organic molecule
Emp. Form.:
C29H32N4O4
Mol. Mass.:
500.5888
SMILES:
CN1CC[C@]23CC(=O)CC[C@@]2(O)[C@H]1Cc1ccc(C(=O)NCCc2ccc(cc2)-c2cn[nH]c2)c(O)c31
: