Target
Potassium voltage-gated channel subfamily H member 2
Ligand
BDBM149382
Substrate
Meas. Tech.
Potassium Channel Assay
IC50
580±n/a nM
Citation
 Choong, ICCory, DGlenn, JSYang, W Methods and compositions of treating a flaviviridae family viral infection US Patent  US8975247 Publication Date 3/10/2015 
Target
Name:
Potassium voltage-gated channel subfamily H member 2
Synonyms:
1,3-beta-glucan synthase component GLS2 ERG Eag-related protein 1 Ether-a-go-go-related gene (HERG) Ether-a-go-go-related gene potassium channel 1 Ether-a-go-go-related gene potassium channel 1 (hERG1) Ether-a-go-go-related protein 1 H-ERG KCNH2 Potassium voltage-gated channel subfamily H member 2 (hERG) Voltage-gated potassium channel subunit Kv11.1 hERG Potassium Channel 1 | putative potassium channel subunit
Type:
Multi-pass membrane protein
Mol. Mass.:
126672.65
Organism:
Homo sapiens (Human)
Description:
Q12809
Residue:
1159
  
Inhibitor
Name:
BDBM149382
Synonyms:
US8975247, EBP881
Type:
Small organic molecule
Emp. Form.:
C23H28ClN3
Mol. Mass.:
381.942
SMILES:
CC1CC(Cc2nc3cc(C)c(C)cc3n2Cc2ccc(Cl)cc2)CCN1
: