Target
Potassium voltage-gated channel subfamily H member 2
Ligand
BDBM149383
Substrate
Meas. Tech.
Potassium Channel Assay
IC50
8800±n/a nM
Citation
 Choong, ICCory, DGlenn, JSYang, W Methods and compositions of treating a flaviviridae family viral infection US Patent  US8975247 Publication Date 3/10/2015 
Target
Name:
Potassium voltage-gated channel subfamily H member 2
Synonyms:
1,3-beta-glucan synthase component GLS2 ERG Eag-related protein 1 Ether-a-go-go-related gene (HERG) Ether-a-go-go-related gene potassium channel 1 Ether-a-go-go-related gene potassium channel 1 (hERG1) Ether-a-go-go-related protein 1 H-ERG KCNH2 Potassium voltage-gated channel subfamily H member 2 (hERG) Voltage-gated potassium channel subunit Kv11.1 hERG Potassium Channel 1 | putative potassium channel subunit
Type:
Multi-pass membrane protein
Mol. Mass.:
126672.65
Organism:
Homo sapiens (Human)
Description:
Q12809
Residue:
1159
  
Inhibitor
Name:
BDBM149383
Synonyms:
US8975247, EBP461
Type:
Small organic molecule
Emp. Form.:
C24H24ClN3
Mol. Mass.:
389.92
SMILES:
CC(Cc1ccncc1)c1nc2cc(C)c(C)cc2n1Cc1ccc(Cl)cc1
: